Target
Macrophage colony-stimulating factor 1 receptor
Ligand
BDBM98631
Substrate
Meas. Tech.
Fluorescence Polarization Competition Assay
pH
7.5±0
IC50
0.66±n/a nM
Citation
 Illig, CRChen, JMeegalia, SKWall, MJ Inhibitors of c-fms kinase US Patent  US8497376 Publication Date 7/30/2013 
Target
Name:
Macrophage colony-stimulating factor 1 receptor
Synonyms:
CSF1R_MOUSE Csfmr Macrophage colony-stimulating factor 1 receptor Proto-oncogene c-Fms
Type:
Protein
Mol. Mass.:
109173.45
Organism:
Mus musculus (Mouse)
Description:
P09581
Residue:
977
  
Inhibitor
Name:
BDBM98631
Synonyms:
US8497376, 12
Type:
Small organic molecule
Emp. Form.:
C28H34N4O5
Mol. Mass.:
506.5934
SMILES:
C[C@@]12C[C@](O)(C[C@@](C)(O1)[C@@H](O)[C@H]2O)c1ccc(NC(=O)c2ncc([nH]2)C#N)c(c1)C1=CCC(C)(C)CC1
: