Target
Beta-lactamase
Ligand
BDBM98862
Substrate
BDBM98856
Meas. Tech.
Spectrophotometric Assay
IC50
1.6±0.0 nM
Citation
 Blizzard, TAChen, HGude, CHermes, JDImbriglio, JKim, SWu, JYMortko, CJMangion, IRivera, NRuck, RTShevlin, M Beta-lactamase inhibitors US Patent  US8487093 Publication Date 7/16/2013 
Target
Name:
Beta-lactamase
Synonyms:
Beta-lactamase (AmpC)
Type:
Enzyme
Mol. Mass.:
43489.98
Organism:
Pseudomonas aeruginosa
Description:
Q3LG62
Residue:
397
  
Inhibitor
Name:
BDBM98862
Synonyms:
US8487093, 8
Type:
Small organic molecule
Emp. Form.:
C14H19N5O6S
Mol. Mass.:
385.396
SMILES:
CN(C)c1cc(NC(=O)[C@@H]2CCC3CN2C(=O)N3OS(O)(=O)=O)ccn1
:
Substrate
Name:
BDBM98856
Synonyms:
US8487093, Substrate
Type:
Small organic molecule
Emp. Form.:
C21H16N4O8S2
Mol. Mass.:
516.504
SMILES:
OC(=O)C1=C(CSC2C(NC(=O)Cc3cccs3)C(=O)N12)\C=C\c1ccc(cc1N(=O)=O)N(=O)=O
: