Target
Sphingosine 1-phosphate receptor 3
Ligand
BDBM101044
Substrate
Meas. Tech.
Inhibition Assay
IC50
3±0.0 nM
Citation
 Beard, RLYuan, HDonello, JELiu, XDuong, T 6-substituted indole-3-carboxylic acid amide compounds having sphingosine-1-phosphate (S1P) receptor antagonist biological activity US Patent  US8524917 Publication Date 9/3/2013 
Target
Name:
Sphingosine 1-phosphate receptor 3
Synonyms:
C9orf108 EDG3 S1P receptor 3 S1P3 S1PR3_HUMAN Sphingosine 1-phosphate receptor 3 (S1P3) | Sphingosine 1-phosphate receptor Edg-3
Type:
G Protein-Coupled Receptor (GPCR)
Mol. Mass.:
42278.13
Organism:
Homo sapiens (Human)
Description:
Q99500
Residue:
378
  
Inhibitor
Name:
BDBM101044
Synonyms:
US8524917, 17
Type:
Small organic molecule
Emp. Form.:
C31H32F2N2O2
Mol. Mass.:
502.5948
SMILES:
CC(C)c1c(C(=O)NCc2ccc(F)c(F)c2)c2ccc(OC3CCCC3)cc2n1Cc1ccccc1
: