Target
Opioid growth factor receptor-like protein 1
Ligand
BDBM4267
Substrate
Meas. Tech.
Binding Assay
Ki
569±0.0 nM
Citation
 Kyle, DJGoehring, RRFundytus, ME Buprenophine analogs US Patent  US8530494 Publication Date 9/10/2013 
Target
Name:
Opioid growth factor receptor-like protein 1
Synonyms:
OGFRL1 Opioid Receptor-Like Receptor (ORL-1) Opioid growth factor receptor-like protein 1 (ORL1) Opioid receptor-like (ORL1) Opioid receptor-like receptor (ORL1)
Type:
Protein
Mol. Mass.:
51247.53
Organism:
Homo sapiens (Human)
Description:
Q5TC84
Residue:
451
  
Inhibitor
Name:
BDBM4267
Synonyms:
US8530494, 11
Type:
Emp. Form.:
C29H35NO4
Mol. Mass.:
461.5925
SMILES:
COc1ccc2C[C@H]3N(C)CC[C@@]45C(Oc1c24)C1(CCC35CC1COCc1ccccc1)OC
: