Target
Isoform 3 of Acetyl-CoA carboxylase 2 (ACC2.v2)
Ligand
BDBM102038
Substrate
Meas. Tech.
Enzyme Assay
IC50
1.0e+2±n/a nM
Citation
 Fleck, MNosse, BHeine, NRoth, GJ Azetidine derivatives US Patent  US8530460 Publication Date 9/10/2013 
Target
Name:
Isoform 3 of Acetyl-CoA carboxylase 2 (ACC2.v2)
Synonyms:
ACACB ACC2 Acetyl-CoA carboxylase 2 (ACC2) | Acetyl-CoA carboxylase 2 (ACC2.v2)
Type:
Protein
Mol. Mass.:
255085.30
Organism:
Homo sapiens (Human)
Description:
AJ575592.3
Residue:
2256
  
Inhibitor
Name:
BDBM102038
Synonyms:
US8530460, 4.32
Type:
Small organic molecule
Emp. Form.:
C19H19ClF3N3O2
Mol. Mass.:
413.821
SMILES:
C[C@H](NC(C)=O)c1ccc(OC2CN(C2)c2ccc(Cl)c(n2)C(F)(F)F)cc1
: