Target
TGF-beta receptor type-1
Ligand
BDBM50262079
Substrate
IC50
117±0.0 nM
Citation
 Mohedas, AHXing, XArmstrong, KABullock, ANCuny, GDYu, PB Development of an ALK2-Biased BMP Type I Receptor Kinase Inhibitor. ACS Chem Biol 8:1291-302 (2013)  
Target
Name:
TGF-beta receptor type-1
Synonyms:
2.7.11.30 AU017197 TGF-beta receptor type I TGFR-1 TbetaR-I Transforming growth factor-beta receptor type I
Type:
Mol. Mass.:
56186.39
Organism:
Mus musculus
Description:
Residue:
503
  
Inhibitor
Name:
BDBM50262079
Synonyms:
4-(6-(4-(piperazin-1-yl)phenyl)pyrazolo[1,5-a]pyrimidin-3-yl)quinoline CHEMBL513147 | LDN-193189
Type:
Small organic molecule
Emp. Form.:
C25H22N6
Mol. Mass.:
406.4824
SMILES:
C1CN(CCN1)c1ccc(cc1)-c1cnc2c(cnn2c1)-c1ccnc2ccccc12
: