Target
Genome polyprotein
Ligand
BDBM103269
Substrate
Meas. Tech.
Inhibition Assay
IC50
1.3e+2±n/a nM
Citation
 Halim, RHarding, MHufton, RMorton, CJJahangiri, SPool, BRJeynes, TPDraffan, AGFrey, BLilly, MJ Viral polymerase inhibitors US Patent  US8546389 Publication Date 10/1/2013 
Target
Name:
Genome polyprotein
Synonyms:
Genome polyprotein POLG_HCVBK | RNA-directed RNA polymerase (NS5B)
Type:
Protein
Mol. Mass.:
327252.46
Organism:
Hepatitis C virus genotype 1b (isolate BK) (HCV)
Description:
P26663
Residue:
3010
  
Inhibitor
Name:
BDBM103269
Synonyms:
US8546389, 174
Type:
Small organic molecule
Emp. Form.:
C27H29BrN6O5S
Mol. Mass.:
629.525
SMILES:
CNC(=O)c1n(nc2cc(N(CCCNC(=O)c3ncoc3C)S(C)(=O)=O)c(cc12)C1CC1)-c1ccc(Br)cc1
: