Target
Serine/threonine-protein kinase B-raf [V600E]
Ligand
BDBM103716
Substrate
Meas. Tech.
Raf/Mek Amplified Luminescence Proximity Homogeneous Assay
pH
7.5±0
IC50
0.38±n/a nM
Citation
 Costales, AQHuang, SJin, JXLiu, ZPecchi, SPoon, DTellew, J Compounds and compositions as protein kinase inhibitors US Patent  US8563553 Publication Date 10/22/2013 
Target
Name:
Serine/threonine-protein kinase B-raf [V600E]
Synonyms:
B-RAF V600E B-Raf Protein Kinase Mutant (V600E) BRAF BRAF mutant V600E BRAF_HUMAN Protein mono-ADP-ribosyltransferase (PARP3) RAFB1 Serine/threonine-protein kinase B-raf (V600E) V-RAF murine sarcoma viral oncogene homologue B1 mutant (BRAF V600E)
Type:
Mol. Mass.:
84474.98
Organism:
Homo sapiens (Human)
Description:
P15056 V600E
Residue:
766
  
Inhibitor
Name:
BDBM103716
Synonyms:
US8563553, 141
Type:
Small organic molecule
Emp. Form.:
C25H34FN7O4S
Mol. Mass.:
547.645
SMILES:
CCCS(=O)(=O)Nc1cccc(-c2[nH]c(nc2-c2ccnc(NC[C@H](C)NC(=O)OC)n2)C(C)(C)C)c1F
: