Target
Fucose-binding lectin PA-IIL
Ligand
BDBM103991
Substrate
IC50
1.102e+5± 2.81e+4 nM
Citation
 Hauck, DJoachim, IFrommeyer, BVarrot, APhilipp, BMöller, HMMöller, AExner, TETitz, A Discovery of two classes of potent glycomimetic inhibitors of Pseudomonas aeruginosa LecB with distinct binding modes. ACS Chem Biol 8:1775-84 (2013)  
Target
Name:
Fucose-binding lectin PA-IIL
Synonyms:
LecB | PA-IIL
Type:
Protein
Mol. Mass.:
11857.84
Organism:
Pseudomonas aeruginosa
Description:
Q9HYN5
Residue:
115
  
Inhibitor
Name:
BDBM103991
Synonyms:
LecB Inhibitor Amides 4b
Type:
Small organic molecule
Emp. Form.:
C14H19NO6
Mol. Mass.:
297.3038
SMILES:
COC1O[C@H](CNC(=O)c2ccccc2)[C@@H](O)C(O)[C@@H]1O
: