Target
Serine/threonine-protein kinase PKH2 [1-944]
Ligand
BDBM104018
Substrate
Meas. Tech.
AlphaScreen Assay
pH
7.4±n/a
Temperature
273.15±n/a K
EC50
66000±0.0 nM
Citation
 Pastor-Flores, DSchulze, JOBahí, ABahí, RFerrer-Dalmau, JPasseron, SEngel, MSüss, ESüss, ABiondi, RM PIF-pocket as a target for C. albicans Pkh selective inhibitors. ACS Chem Biol 8:2283-92 (2013)  
Target
Name:
Serine/threonine-protein kinase PKH2 [1-944]
Synonyms:
Likely protein kinase PKH2 Serine/threonine-protein kinase 2 (CaPkh2)
Type:
Protein
Mol. Mass.:
106226.24
Organism:
Candida albicans SC5314
Description:
Q5A3P6[1-944]
Residue:
944
  
Inhibitor
Name:
BDBM104018
Synonyms:
PS182
Type:
Small organic molecule
Emp. Form.:
C18H15ClO5
Mol. Mass.:
346.762
SMILES:
OC(=O)C(C(CC(=O)c1ccc(Cl)cc1)c1ccccc1)C(O)=O
: