Target
Dual specificity mitogen-activated protein kinase kinase 1
Ligand
BDBM50222709
Substrate
Meas. Tech.
Inhibition Assay
IC50
2±n/a nM
Citation
 Isshiki, YKohchi, YMizuguchi, EIikura, HMatsubara, YTsujii, SShimma, NMiwa, MAida, SKohchi, MMurata, TAso, K 5-substituted-2-phenylamino benzamides as MEK inhibitors US Patent  US8575391 Publication Date 11/5/2013 
Target
Name:
Dual specificity mitogen-activated protein kinase kinase 1
Synonyms:
Dual specificity mitogen-activated protein kinase (MEK) Dual specificity mitogen-activated protein kinase kinase 1 (MEK1) Dual specificity mitogen-activated protein kinase kinase MEK1/2 MAP kinase kinase 1 MAPK/ERK kinase 1 MEK-1 MP2K1_HUMAN PRKMK1 | VHL-MAP2K1/MAP2K2
Type:
Other Protein Type
Mol. Mass.:
43439.03
Organism:
Homo sapiens (Human)
Description:
Full-length human MEK-1 was generated by PCR and purified as a fusion protein from Escherichia coli lysates.
Residue:
393
  
Inhibitor
Name:
BDBM50222709
Synonyms:
3,4-difluoro-2-(2-fluoro-4-iodophenylamino)-N-(2-hydroxyethoxy)benzamide PD-0316684 | US8575391, 339
Type:
Small organic molecule
Emp. Form.:
C15H12F3IN2O3
Mol. Mass.:
452.1671
SMILES:
OCCONC(=O)c1ccc(F)c(F)c1Nc1ccc(I)cc1F
: