Target
Trace amine-associated receptor 1
Ligand
BDBM106610
Substrate
Meas. Tech.
Binding Assay
Temperature
277.15±0 K
Ki
9±n/a nM
Citation
 Galley, GGoergler, AZbinden, KGNorcross, RStalder, H Aminomethyl-4-imidazoles US Patent  US8586617 Publication Date 11/19/2013 
Target
Name:
Trace amine-associated receptor 1
Synonyms:
TAAR1_MOUSE Taar1 Trace amine receptor 1 (TARR1) Trace amine-associated receptor1 | Trar1
Type:
Protein
Mol. Mass.:
37635.41
Organism:
Mus musculus (Mouse)
Description:
Q923Y8
Residue:
332
  
Inhibitor
Name:
BDBM106610
Synonyms:
US8586617, 115
Type:
Small organic molecule
Emp. Form.:
C14H16F3N3O
Mol. Mass.:
299.2915
SMILES:
CC(C)N(Cc1cnc[nH]1)c1cccc(OC(F)(F)F)c1
: