Target
ALK tyrosine kinase receptor
Ligand
BDBM107040
Substrate
Meas. Tech.
Enzyme Assay
IC50
23±n/a nM
Citation
 Chen, BJiang, TMarsilje, THMichellys, PNguyen, TNPei, WWu, BGao, ZGe, YHuang, CLi, YZhu, X Compounds and compositions as protein kinase inhibitors US Patent  US8592432 Publication Date 11/26/2013 
Target
Name:
ALK tyrosine kinase receptor
Synonyms:
ALK ALK_HUMAN CD_antigen: CD246
Type:
Protein
Mol. Mass.:
176453.10
Organism:
Homo sapiens (Human)
Description:
Q9UM73
Residue:
1620
  
Inhibitor
Name:
BDBM107040
Synonyms:
US8592432, 15
Type:
Small organic molecule
Emp. Form.:
C35H44ClN7O5S
Mol. Mass.:
710.286
SMILES:
CC(C)Oc1cc2CN(C3CCN(CC3)C(=O)[C@@H]3CCCN3C)C(=O)c2cc1Nc1ncc(Cl)c(Nc2ccccc2S(=O)(=O)C(C)C)n1
: