Target
Beta-galactosidase
Ligand
BDBM108219
Substrate
Meas. Tech.
Inhibition Assay Against Commercial Glycosidases
pH
10.6±n/a
Temperature
310.15±n/a K
IC50
1.0e+2±n/a nM
Comments
extracted
Citation
 Li, ZLi, TDai, SXie, XMa, XZhao, WZhang, WLi, JWang, PG New insights into the pharmacological chaperone activity of c2-substituted glucoimidazoles for the treatment of Gaucher disease. Chembiochem 14:1239-47 (2013)  
Target
Name:
Beta-galactosidase
Synonyms:
β-galactosidase Beta-galactosidase/Glucosylceramidase | GLB1
Type:
Protein
Mol. Mass.:
73420.88
Organism:
Bos taurus (Bovine)
Description:
Residue:
653
  
Inhibitor
Name:
BDBM108219
Synonyms:
5-(hydroxymethyl)-2-[3-(4-methylphenyl)propyl]- 5H,6H,7H,8H-imidazo[1,2-a]pyridine-6,7,8-triol (Compound 5)
Type:
Small organic molecule
Emp. Form.:
C18H24N2O4
Mol. Mass.:
332.3942
SMILES:
Cc1ccc(CCCc2cn3C(CO)C(O)C(O)C(O)c3n2)cc1
: