Target
1-deoxy-D-xylulose-5-phosphate synthase
Ligand
BDBM108229
Substrate
Meas. Tech.
DXP Synthase Inhibition Assay
pH
8±n/a
Temperature
310.15±n/a K
IC50
5.22e+5± 6.0e+4 nM
Comments
extracted
Citation
 Morris, FVierling, RBoucher, LBosch, JFreel Meyers, CL DXP synthase-catalyzed C-N bond formation: nitroso substrate specificity studies guide selective inhibitor design. Chembiochem 14:1309-15 (2013)  
Target
Name:
1-deoxy-D-xylulose-5-phosphate synthase
Synonyms:
1-Deoxy-D-xylulose-5-phosphate synthase (DXP synthase)) dxs | yajP
Type:
Protein
Mol. Mass.:
67617.17
Organism:
Escherichia coli K-12 (Enterobacteria)
Description:
Residue:
620
  
Inhibitor
Name:
BDBM108229
Synonyms:
6‐bromo‐1‐nitrosonaphthalen‐2‐ol (Substrate 6)
Type:
Small organic molecule
Emp. Form.:
C10H6BrNO2
Mol. Mass.:
252.064
SMILES:
Oc1ccc2cc(Br)ccc2c1N=O
: