Target
Lysosomal acid glucosylceramidase
Ligand
BDBM108418
Substrate
Meas. Tech.
Enzyme Inhibition Assay
pH
7±0
Ki
0.9± 0.4 nM
IC50
17.1± 0.8 nM
Citation
 Boyd, RLee, GRybczynski, P Compositions for preventing and/or treating degenerative disorders of the central nervous system US Patent  US8604206 Publication Date 12/10/2013 
Target
Name:
Lysosomal acid glucosylceramidase
Synonyms:
Acid beta-glucosidase Beta-glucocerebrosidase D-glucosyl-N-acylsphingosine glucohydrolase GBA1 GC GLUC Glucosylceramidase (GBA) Glucosylceramidase precursor (Beta-glucocerebrosidase) (Acid beta-glucosidase) (D-glucosyl-N-acylsphingosine glucohydrolase) (Alglucerase) (Imiglucerase) beta-glucocerebrosidase (GCase)
Type:
Enzyme
Mol. Mass.:
59724.64
Organism:
Homo sapiens (Human)
Description:
The beta-Glu activity was measured with commercially available beta-glucocerebrosidase (Ceredase) as the enzyme source.
Residue:
536
  
Inhibitor
Name:
BDBM108418
Synonyms:
US8604206, 13 | US8604206, 14
Type:
Small oganic molecule
Emp. Form.:
C7H14FNO2
Mol. Mass.:
163.19
SMILES:
CC(F)[C@H]1CNC[C@@H](O)[C@@H]1O
: