Target
Aurora kinase A
Ligand
BDBM109207
Substrate
Meas. Tech.
Dissociation Kinetics Assay
Temperature
303.15±n/a K
Kd
5.20±0.58 nM
Comments
extracted
Citation
 Lavogina, DEnkvist, EViht, KUri, A Long residence times revealed by Aurora A kinase-targeting fluorescent probes derived from inhibitors MLN8237 and VX-689. Chembiochem 15:443-50 (2014)  
Target
Name:
Aurora kinase A
Synonyms:
AIK ARK1 AURKA AYK1 Aurora kinase A (AURA) Aurora kinase A (Aurora A) Aurora-related kinase 1 BTAK Breast-tumor-amplified kinase STK15 Serine/threonine kinase 15 Serine/threonine-protein kinase aurora A hARK1
Type:
Serine/threonine-protein kinase
Mol. Mass.:
45830.98
Organism:
Homo sapiens (Human)
Description:
O14965
Residue:
403
  
Inhibitor
Name:
BDBM109207
Synonyms:
Compound II: Ac-D-Arg6-D-Lys(PromoFluor 647)-D-Lys(MLN8237*)-NH2
Type:
Small organic molecule
Emp. Form.:
C109H160ClFN35O19S2
Mol. Mass.:
2383.238
SMILES:
[#6]-[#6]-[#7]-1\[#6](=[#6]\[#6]=[#6]\[#6]=[#6]\[#6]2=[#7+](-[#6]-[#6])-c3ccc(cc3C2([#6])[#6])S([#8-])(=O)=O)C([#6])([#6]-[#6]-[#6]-[#6](=O)-[#7]-[#6]-[#6]-[#6]-[#6]-[#6](-[#7]-[#6](=O)-[#6](-[#6]-[#6]-[#6]\[#7+]=[#6](\[#7])-[#7])-[#7]-[#6](=O)-[#6](-[#6]-[#6]-[#6]-[#7]-[#6](-[#7])=[#7+])-[#7]-[#6](=O)-[#6](-[#6]-[#6]-[#6]-[#7]-[#6](-[#7])=[#7+])-[#7]-[#6](=O)-[#6](-[#6]-[#6]-[#6]-[#7]-[#6](-[#7])=[#7+])-[#7]-[#6](=O)-[#6](-[#6]-[#6]-[#6]-[#7]-[#6](-[#7])=[#7+])-[#7]-[#6](=O)-[#6](-[#6]-[#6]-[#6]-[#7]-[#6](-[#7])=[#7+])-[#7]-[#6](-[#6])=O)-[#6](=O)-[#7]-[#6](-[#6]-[#6]-[#6]-[#6]-[#7]-[#6](=O)-c2ccc(-[#7]-c3ncc4-[#6]-[#7]=[#6](-c5cc(Cl)ccc5-c4n3)-c3c(F)cccc3-[#8]-[#6])cc2-[#8]-[#6])-[#6](-[#7])=O)c2cc(ccc-12)S([#8-])(=O)=O
: