Target
Tyrosine-protein kinase JAK3
Ligand
BDBM112532
Substrate
Meas. Tech.
Inhibition Assay
pH
7.2±n/a
Ki
0.015169±n/a nM
IC50
0.02957±n/a nM
Citation
 de Vicente Fidalgo, JHermann, JCLemoine, RLi, HLovey, AJSjogren, EBSoth, M Inhibitors of JAK US Patent  US8618103 Publication Date 12/31/2013 
Target
Name:
Tyrosine-protein kinase JAK3
Synonyms:
JAK-3 JAK3_HUMAN Janus kinase 3 (JAK3) L-JAK | Leukocyte janus kinase
Type:
Protein
Mol. Mass.:
125111.08
Organism:
Homo sapiens (Human)
Description:
P52333
Residue:
1124
  
Inhibitor
Name:
BDBM112532
Synonyms:
US8618103, I-28
Type:
Small organic molecule
Emp. Form.:
C20H26N6O2S
Mol. Mass.:
414.524
SMILES:
CC(C)S(=O)(=O)N1C[C@@H](C)C[C@@H](C1)Nc1ncccc1-c1cnc2[nH]ccc2n1
: