Target
Disintegrin and metalloproteinase domain-containing protein 17
Ligand
BDBM114002
Substrate
Meas. Tech.
QFRET-based biochemical high throughput dose response assay to identify exosite inhibitors of ADAM17
IC50
69510±n/a nM
Citation
 PubChem, PC QFRET-based biochemical high throughput dose response assay to identify exosite inhibitors of ADAM17 PubChem Bioassay (2014)[AID] 
Target
Name:
Disintegrin and metalloproteinase domain-containing protein 17
Synonyms:
ADA17_HUMAN CSVP Disintegrin and metalloproteinase domain-containing protein 17 (ADAM17) TNF-alpha convertase TNF-alpha-converting enzyme (TACE) Tumor necrosis factor-α converting enzyme (TACE)
Type:
Enzyme
Mol. Mass.:
93007.89
Organism:
Homo sapiens (Human)
Description:
Residue:
824
  
Inhibitor
Name:
BDBM114002
Synonyms:
MLS000519054 N-[3-(2-phenyl-4-thiazolyl)phenyl]-2-thiophenecarboxamide SMR000129474 | cid_3574419
Type:
Small organic molecule
Emp. Form.:
C20H14N2OS2
Mol. Mass.:
362.468
SMILES:
O=C(Nc1cccc(c1)-c1csc(n1)-c1ccccc1)c1cccs1
: