Target
Methyl-CpG-binding domain protein 2
Ligand
BDBM114638
Substrate
Meas. Tech.
TRFRET-based biochemical high throughput dose response assay to identify inhibitors of 5-meCpG-binding domain protein 2 (MBD2)-DBD binding to methylated oligonucleotide
IC50
17055±n/a nM
Citation
 PubChem, PC TRFRET-based biochemical high throughput dose response assay to identify inhibitors of 5-meCpG-binding domain protein 2 (MBD2)-DBD binding to methylated oligonucleotide PubChem Bioassay (2013)[AID] 
Target
Name:
Methyl-CpG-binding domain protein 2
Synonyms:
MBD2 Methyl-CpG binding domain protein 2 | Methyl-CpG-binding domain protein 2 (MBD2)
Type:
Enzyme Catalytic Domain
Mol. Mass.:
43278.74
Organism:
Homo sapiens (Human)
Description:
gi_21595776
Residue:
411
  
Inhibitor
Name:
BDBM114638
Synonyms:
4-(3-Dimethylamino-propylamino)-benzo[h]quinoline-3-carboxylic acid ethyl ester 4-[3-(dimethylamino)propylamino]benzo[h]quinoline-3-carboxylic acid ethyl ester SMR000517833 ethyl 4-[3-(dimethylamino)propylamino]benzo[h]quinoline-3-carboxylate
Type:
Small organic molecule
Emp. Form.:
C21H25N3O2
Mol. Mass.:
351.4421
SMILES:
CCOC(=O)c1cnc2c(ccc3ccccc23)c1NCCCN(C)C
: