Target
Methyl-CpG-binding domain protein 2
Ligand
BDBM114650
Substrate
Meas. Tech.
TRFRET-based biochemical high throughput dose response assay to identify inhibitors of 5-meCpG-binding domain protein 2 (MBD2)-DBD binding to methylated oligonucleotide
IC50
12577±n/a nM
Citation
 PubChem, PC TRFRET-based biochemical high throughput dose response assay to identify inhibitors of 5-meCpG-binding domain protein 2 (MBD2)-DBD binding to methylated oligonucleotide PubChem Bioassay (2013)[AID] 
Target
Name:
Methyl-CpG-binding domain protein 2
Synonyms:
MBD2 Methyl-CpG binding domain protein 2 | Methyl-CpG-binding domain protein 2 (MBD2)
Type:
Enzyme Catalytic Domain
Mol. Mass.:
43278.74
Organism:
Homo sapiens (Human)
Description:
gi_21595776
Residue:
411
  
Inhibitor
Name:
BDBM114650
Synonyms:
MLS002607797 N-[3-(1,3-benzothiazol-2-yl)-5,6,7,8-tetrahydro-4H-thieno[2,3-c]azepin-2-yl]acetamide;2,2,2-trifluoroacetic acid SMR001522671 | cid_53338856
Type:
Small organic molecule
Emp. Form.:
C17H17N3OS2
Mol. Mass.:
343.466
SMILES:
CC(=O)Nc1sc2CNCCCc2c1-c1nc2ccccc2s1
: