Target
Methyl-CpG-binding domain protein 2
Ligand
BDBM114653
Substrate
Meas. Tech.
TRFRET-based biochemical high throughput dose response assay to identify inhibitors of 5-meCpG-binding domain protein 2 (MBD2)-DBD binding to methylated oligonucleotide
IC50
5859±n/a nM
Citation
 PubChem, PC TRFRET-based biochemical high throughput dose response assay to identify inhibitors of 5-meCpG-binding domain protein 2 (MBD2)-DBD binding to methylated oligonucleotide PubChem Bioassay (2013)[AID] 
Target
Name:
Methyl-CpG-binding domain protein 2
Synonyms:
MBD2 Methyl-CpG binding domain protein 2 | Methyl-CpG-binding domain protein 2 (MBD2)
Type:
Enzyme Catalytic Domain
Mol. Mass.:
43278.74
Organism:
Homo sapiens (Human)
Description:
gi_21595776
Residue:
411
  
Inhibitor
Name:
BDBM114653
Synonyms:
CHEMBL1719929 N-[3-(1,3-benzothiazol-2-yl)-6-methyl-5,7-dihydro-4H-thieno[2,3-c]pyridin-2-yl]acetamide;2,2,2-trifluoroacetic acid SMR001882357 | cid_60138097
Type:
Small organic molecule
Emp. Form.:
C17H17N3OS2
Mol. Mass.:
343.466
SMILES:
CN1CCc2c(C1)sc(NC(C)=O)c2-c1nc2ccccc2s1
: