Target
cAMP and cAMP-inhibited cGMP 3',5'-cyclic phosphodiesterase 10A
Ligand
BDBM115430
Substrate
Meas. Tech.
Enzyme Inhibition Assay
Temperature
298.15±n/a K
IC50
0.045±n/a nM
Comments
extracted
Citation
 Allen, JRChen, NFalsey, JRFrohn, MJHarrington, PEHarrington, EHKaller, MRKunz, RKNguyen, TTPickrell, AJReichelt, ARumfelt, SRzasa, RMSham, KSiegmund, ACYao, G Aminopyridine and carboxypyridine compounds as phosphodiesterase 10 inhibitors US Patent  US8637500 Publication Date 1/28/2014 
Target
Name:
cAMP and cAMP-inhibited cGMP 3',5'-cyclic phosphodiesterase 10A
Synonyms:
PDE10_RAT Phosphodiesterase 10 Phosphodiesterase Type 10 (PDE10A) | Rat recombinant PDE10a (rPDE10a)
Type:
Enzyme
Mol. Mass.:
90160.88
Organism:
Rattus norvegicus (rat)
Description:
PDE10A was generated from the full-length recombinant rat clone transfected into Sf9 cells.
Residue:
794
  
Inhibitor
Name:
BDBM115430
Synonyms:
US8637500, 299
Type:
Small organic molecule
Emp. Form.:
C24H28N6O2
Mol. Mass.:
432.5181
SMILES:
CN(C)C(=O)N1CCC(CC1)c1nccnc1Oc1ccc(Nc2ccc(C)cn2)cc1
: