Target
Aurora kinase A
Ligand
BDBM116987
Substrate
Meas. Tech.
Enzyme Assay
IC50
0.08±n/a nM
Citation
 Sutton, AELan, RRichardson, TEPerrey, DVandeveer, HGHuck, BRKarra, SRChen, XXiao, YLiu-Bujalski, LGoutopoulos, AStieber, FHodous, BLQiu, HJones, RHeasley, BH Amino azaheterocyclic carboxamides US Patent  US8637532 Publication Date 1/28/2014 
Target
Name:
Aurora kinase A
Synonyms:
AIK ARK-1 AURA AURKA_HUMAN Aurora 2 Aurora kinase A (AURKA) Aurora kinase A (Aurora-2) Aurora/IPL1-related kinase 1 Breast tumor-amplified kinase IAK1 STK15 GN Serine/threonine kinase 15 Serine/threonine-protein kinase 6 Serine/threonine-protein kinase aurora-A aurora-2 | hARK1
Type:
Serine/threonine-protein kinase
Mol. Mass.:
45830.98
Organism:
Homo sapiens (Human)
Description:
O14965
Residue:
403
  
Inhibitor
Name:
BDBM116987
Synonyms:
US8637532, 714
Type:
Small organic molecule
Emp. Form.:
C23H16ClF2N5O2
Mol. Mass.:
467.855
SMILES:
NC(=O)c1cccc2c(NCc3cccc(NC(=O)c4c(F)cc(Cl)cc4F)c3)ncnc12
: