Target
UDP-N-acetylglucosamine 1-carboxyvinyltransferase
Ligand
BDBM119070
Substrate
IC50
1.03e+4±n/a nM
Citation
 Hrast, MSosic, ISink, RGobec, S Inhibitors of the peptidoglycan biosynthesis enzymes MurA-F. Bioorg Chem 55:2-15 (2014)  
Target
Name:
UDP-N-acetylglucosamine 1-carboxyvinyltransferase
Synonyms:
EPT MURA_ECOLI UDP-N-acetylglucosamine 1-carboxyvinyltransferase murA | murZ
Type:
Protein
Mol. Mass.:
44814.62
Organism:
Escherichia coli K-12 (Enterobacteria)
Description:
E. coli MurA
Residue:
419
  
Inhibitor
Name:
BDBM119070
Synonyms:
Cnicin (compound 5)
Type:
Small organic molecule
Emp. Form.:
C19H24O7
Mol. Mass.:
364.3897
SMILES:
OC[C@@H](O)C(=C)C(=O)OC1C\C=C\CC\C(CO)=C\[C@H]2OC(=O)C(=C)[C@H]12
: