Target
Arachidonate 5-lipoxygenase-activating protein
Ligand
BDBM283262
Substrate
Meas. Tech.
Binding Assay
Ki
<0.1±n/a nM
Citation
 Bacani, GMEccles, WFitzgerald, AEGoldberg, SDHack, MDHawryluk, NAJones, WMKeith, JMKrawczuk, PLebsack, ADLee-Dutra, ALiu, JMcClure, KJMeduna, SPPippel, DJRosen, MDSales, ZS FLAP modulators US Patent  US9884878 Publication Date 2/6/2018 
Target
Name:
Arachidonate 5-lipoxygenase-activating protein
Synonyms:
5-lipoxygenase activating protein 5-lipoxygenase/FLAP ALOX5AP MK-886-binding protein
Type:
Enzyme
Mol. Mass.:
18159.90
Organism:
Homo sapiens (Human)
Description:
P20292
Residue:
161
  
Inhibitor
Name:
BDBM283262
Synonyms:
(S)-(1-{[4'-(5-Aminopyrazin-2-yl)-3'- fluorobiphenyl-2-yl]sulfonyl}-2,3-dihydro-1H- indol-2-yl)methanol US9884878, Compound 135
Type:
Small organic molecule
Emp. Form.:
C25H21FN4O3S
Mol. Mass.:
476.523
SMILES:
Nc1cnc(cn1)-c1ccc(cc1F)-c1ccccc1S(=O)(=O)N1[C@H](CO)Cc2ccccc12
: