Target
Myeloperoxidase
Ligand
BDBM119872
Substrate
Meas. Tech.
MPO Activity Assay
pH
7.4±n/a
Ki
413±54 nM
Comments
extracted
Citation
 Ward, JSpath, SNPabst, BCarpino, PARuggeri, RBXing, GSpeers, AECravatt, BFAhn, K Mechanistic characterization of a 2-thioxanthine myeloperoxidase inhibitor and selectivity assessment utilizing click chemistry--activity-based protein profiling. Biochemistry 52:9187-201 (2013)  
Target
Name:
Myeloperoxidase
Synonyms:
84 kDa myeloperoxidase MPO Myeloperoxidase Myeloperoxidase heavy chain PERM_HUMAN
Type:
Enzyme
Mol. Mass.:
83888.32
Organism:
Homo sapiens (Human)
Description:
P05164
Residue:
745
  
Inhibitor
Name:
BDBM119872
Synonyms:
3‐(2‐ethoxypropyl)‐2‐sulfanylidene‐1,9‐ dihydropurin‐6‐one (A)
Type:
Small organic molecule
Emp. Form.:
C10H14N4O2S
Mol. Mass.:
254.309
SMILES:
CCOC(C)Cn1c2nc[nH]c2c(=O)[nH]c1=S
: