Target
N-lysine methyltransferase SMYD2
Ligand
BDBM283205
Substrate
Meas. Tech.
Scintillation Proximity Assay (SPA) for Detection of SMYD2 Enzymatic Inhibition
pH
9±n/a
IC50
22.9±n/a nM
Comments
extracted
Citation
 Mowat, JSStellfeld, TStresemann, CHillig, RKöhr, SStöckigt, DWeiske, JBrumby, TBarak, NChrist, CTer Laak, ABadock, VCrampton, RHStefanuti, I Aryl-cyanoguanidine compounds US Patent  US10023539 Publication Date 7/17/2018 
Target
Name:
N-lysine methyltransferase SMYD2
Synonyms:
HSKM-B KMT3C N-lysine methyltransferase SMYD2 SET and MYND domain-containing protein 2 (SMYD2) SMYD2_HUMAN
Type:
Enzyme
Mol. Mass.:
49689.57
Organism:
Homo sapiens (Human)
Description:
Q9NRG4
Residue:
433
  
Inhibitor
Name:
BDBM283205
Synonyms:
N-[3-(4-Chloro-3-methylphenyl)-1-{N′-cyano-N-[3-(difluoromethoxy)phenyl]carbamimidoyl}-4,5-dihydro-1H-pyrazol-4-yl]-N-ethyl-N2-methylglycinamide Isomer 2 US10023539, Example 36.2
Type:
Small organic molecule
Emp. Form.:
C24H26ClF2N7O2
Mol. Mass.:
517.959
SMILES:
CCN(C1CN(N=C1c1ccc(Cl)c(C)c1)C(\Nc1cccc(OC(F)F)c1)=N/C#N)C(=O)CNC
: