Target
Tyrosine-protein kinase SYK
Ligand
BDBM122290
Substrate
Meas. Tech.
Mobility-Shift kinase assay
IC50
219±n/a nM
Citation
 Che, JDing, QHe, XLiu, HLiu, YMichellys, POkram, BWu, XYang, KZhu, X Compounds and compositions as Syk kinase inhibitors US Patent  US8722692 Publication Date 5/13/2014 
Target
Name:
Tyrosine-protein kinase SYK
Synonyms:
KSYK_HUMAN Spleen Tyrosine Kinase Tyrosine-protein kinase SYK (Syk)
Type:
Enzyme
Mol. Mass.:
72079.99
Organism:
Homo sapiens (Human)
Description:
P43405
Residue:
635
  
Inhibitor
Name:
BDBM122290
Synonyms:
US8722692, 730
Type:
Small organic molecule
Emp. Form.:
C19H20N6O
Mol. Mass.:
348.4017
SMILES:
Cn1cnc2cc(nc(NC3CC3)c2c1=O)-c1ccc(nc1)C1(N)CC1
: