Target
3-phosphoinositide-dependent protein kinase 1
Ligand
BDBM123416
Substrate
Meas. Tech.
In Vitro Kinase Assay
IC50
42000±n/a nM
Citation
 Chen, CChiu, HWang, D Anti-infective agents against intracellular pathogens US Patent  US8741944 Publication Date 6/3/2014 
Target
Name:
3-phosphoinositide-dependent protein kinase 1
Synonyms:
3-Phosphoinositide-Dependent Protein Kinase 1 (PDK1) 3-phosphoinositide-dependent protein kinase 1 3-phosphoinositide-dependent protein kinase 1 (PDK-1) Isoform 2 of 3-phosphoinositide-dependent protein kinase 1 PDPK1 Phosphoinositide-dependent protein kinase 1 (PDK1) hPDK1
Type:
Enzyme
Mol. Mass.:
63157.65
Organism:
Homo sapiens (Human)
Description:
O15530
Residue:
556
  
Inhibitor
Name:
BDBM123416
Synonyms:
US8741944, 37
Type:
Small organic molecule
Emp. Form.:
C18H15BrF3N3O2S
Mol. Mass.:
474.295
SMILES:
NS(=O)(=O)c1ccc(cc1)-n1nc(cc1-c1ccc(CCBr)cc1)C(F)(F)F
: