Target
Proto-oncogene tyrosine-protein kinase receptor Ret [658-1114]
Ligand
BDBM284581
Substrate
Meas. Tech.
RET Enzyme Assay
pH
7.4±n/a
IC50
16.5±n/a nM
Comments
extracted
Citation
 Andrews, SWBlake, JFChicarelli, MJGolos, AHaas, JJiang, YKolakowski, GR Substituted pyrazolo[1,5-A]pyridine compounds as RET kinase inhibitors US Patent  US10023570 Publication Date 7/17/2018 
Target
Name:
Proto-oncogene tyrosine-protein kinase receptor Ret [658-1114]
Synonyms:
CDHF12 PTC Proto-oncogene tyrosine-protein kinase receptor Ret (aa 658-1114) RET Kinase (aa 658-1114) RET_HUMAN
Type:
Mol. Mass.:
51535.16
Organism:
Homo sapiens (Human)
Description:
P07949[658-1114]
Residue:
457
  
Inhibitor
Name:
BDBM284581
Synonyms:
US10023570, Example 609 | US10174027, Example 609
Type:
Small organic molecule
Emp. Form.:
C30H30N8
Mol. Mass.:
502.6128
SMILES:
CCn1cc(c(C)n1)-c1cc(-c2ccc(nc2)N2CCN(Cc3ccccc3)CC2)c2c(cnn2c1)C#N
: