Target
Epithelial discoidin domain-containing receptor 1
Ligand
BDBM124970
Substrate
Meas. Tech.
Kinase Screen Assay
Kd
3.4±n/a nM
Citation
 Choi, HGSim, TGray, NZhou, WChang, JWZhang, JWeisberg, E Fused 2-aminothiazole compounds US Patent  US8765747 Publication Date 7/1/2014 
Target
Name:
Epithelial discoidin domain-containing receptor 1
Synonyms:
CAK DDR1_HUMAN Discoidin domain-containing receptor 1 (DDR1) EDDR1 Epithelial discoidin domain receptor 1 (DDR1) Epithelial discoidin domain-containing receptor 1 (DDR1) Mammary carcinoma kinase 10 NTRK4 Protein-tyrosine kinase RTK 6 TRKE | Tyrosine-protein kinase CAK
Type:
Tyrosine-protein kinase
Mol. Mass.:
101130.02
Organism:
Homo sapiens (Human)
Description:
Q08345
Residue:
913
  
Inhibitor
Name:
BDBM124970
Synonyms:
US8765747, 2
Type:
Small organic molecule
Emp. Form.:
C31H31F3N6O2S
Mol. Mass.:
608.677
SMILES:
CCN1CCN(Cc2ccc(NC(=O)c3cccc(c3)-c3ccc4nc(NC(=O)C5CC5)sc4n3)cc2C(F)(F)F)CC1
: