Target
Platelet-derived growth factor receptor alpha
Ligand
BDBM124970
Substrate
Meas. Tech.
Kinase Screen Assay
Kd
7.7±n/a nM
Citation
 Choi, HGSim, TGray, NZhou, WChang, JWZhang, JWeisberg, E Fused 2-aminothiazole compounds US Patent  US8765747 Publication Date 7/1/2014 
Target
Name:
Platelet-derived growth factor receptor alpha
Synonyms:
Alpha-type platelet-derived growth factor receptor PDGFRA PGFRA_HUMAN Platelet-derived growth factor receptor alpha (PDGFRA) RHEPDGFRA
Type:
Protein
Mol. Mass.:
122633.38
Organism:
Homo sapiens (Human)
Description:
P16234
Residue:
1089
  
Inhibitor
Name:
BDBM124970
Synonyms:
US8765747, 2
Type:
Small organic molecule
Emp. Form.:
C31H31F3N6O2S
Mol. Mass.:
608.677
SMILES:
CCN1CCN(Cc2ccc(NC(=O)c3cccc(c3)-c3ccc4nc(NC(=O)C5CC5)sc4n3)cc2C(F)(F)F)CC1
: