Target
Tyrosine-protein kinase SYK
Ligand
BDBM127947
Substrate
Meas. Tech.
Homogeneous Time-Resolved Fluorescence Assay
pH
7.5±n/a
IC50
<0.50±n/a nM
Comments
extracted
Citation
 Romeo, ETMachacek, MRTrotter, BWMiller, TAAndresen, BMAnthony, NJTaoka, BMLiu, Y Amino-pyridine-containing spleen tyrosine kinase (SYK) inhibitors US Patent  US8796310 Publication Date 8/5/2014 
Target
Name:
Tyrosine-protein kinase SYK
Synonyms:
KSYK_HUMAN Spleen Tyrosine Kinase Tyrosine-protein kinase SYK (Syk)
Type:
Enzyme
Mol. Mass.:
72079.99
Organism:
Homo sapiens (Human)
Description:
P43405
Residue:
635
  
Inhibitor
Name:
BDBM127947
Synonyms:
US8796310, 1K
Type:
Small organic molecule
Emp. Form.:
C29H28N4O3S
Mol. Mass.:
512.623
SMILES:
Cc1cc(Nc2cc(ccn2)C2CCC2)nc(c1)-c1cnc(s1)C1(O)CCCc2cc(ccc12)C(O)=O
: