Target
Rho-associated protein kinase 2
Ligand
BDBM50307942
Substrate
Meas. Tech.
Inhibition Assay
pH
7.5±n/a
Temperature
298.15±n/a K
IC50
143±n/a nM
Comments
extracted
Citation
 Davies, TGGarrett, MDBoyle, RGCollins, I Purine and deazapurine derivatives as pharmaceutical compounds US Patent  US8796293 Publication Date 8/5/2014 
Target
Name:
Rho-associated protein kinase 2
Synonyms:
KIAA0619 ROCK2 Rho kinase 2 (ROCKII) Rho-associated protein kinase 2 (ROCK2) Rho-associated protein kinase 2/Transforming protein RhoA Rho-associated, coiled-coil-containing protein kinase II p164 ROCK-2
Type:
Protein
Mol. Mass.:
160885.43
Organism:
Homo sapiens (Human)
Description:
O75116
Residue:
1388
  
Inhibitor
Name:
BDBM50307942
Synonyms:
4-Amino-N-(4-chlorobenzyl)-1-(7H-pyrrolo[2,3-d]pyrimidin-4-yl)piperidine-4-carboxamide US8796293, 69
Type:
Small organic molecule
Emp. Form.:
C19H21ClN6O
Mol. Mass.:
384.863
SMILES:
NC1(CCN(CC1)c1ncnc2[nH]ccc12)C(=O)NCc1ccc(Cl)cc1
: