Target
Muscarinic acetylcholine receptor M3
Ligand
BDBM6384
Substrate
Meas. Tech.
Radioligand Binding Assay
Ki
0.1±n/a nM
Citation
 Hughes, ADChen, YJacobsen, JRStangeland, ELYen, R Diamide compounds having muscarinic receptor antagonist and β2 adrenergic receptor agonist activity US Patent  US8816088 Publication Date 8/26/2014 
Target
Name:
Muscarinic acetylcholine receptor M3
Synonyms:
ACM3_HUMAN Cholinergic, muscarinic M3 Muscarinic receptor M3 | RecName: Full=Muscarinic acetylcholine receptor M3
Type:
Enzyme
Mol. Mass.:
66151.03
Organism:
Homo sapiens (Human)
Description:
P20309
Residue:
590
  
Inhibitor
Name:
BDBM6384
Synonyms:
US8551978, I-14 US8816088, I-15 US9572802, Compound I-14 | US9682957, I-14
Type:
Emp. Form.:
C45H52N6O7
Mol. Mass.:
788.9304
SMILES:
CN(CCCCC(=O)Nc1ccc(CNC[C@H](O)c2ccc(O)c3[nH]c(=O)ccc23)cc1)C(=O)CCN1CCC(CC1)OC(=O)Nc1ccccc1-c1ccccc1
: