Target
Sphingosine 1-phosphate receptor 1
Ligand
BDBM130386
Substrate
Meas. Tech.
Binding Assay
pH
7.5±n/a
Temperature
298.15±n/a K
IC50
0.12±n/a nM
Comments
extracted
Citation
 Das, JKoo, SSSrivastava, ASMoquin, RVWatterson, SH Substituted 3-phenyl-1,2,4-Oxadiazole compounds US Patent  US8822510 Publication Date 9/2/2014 
Target
Name:
Sphingosine 1-phosphate receptor 1
Synonyms:
CHEDG1 Endothelial differentiation G-protein coupled receptor 1 S1P1 S1PR1_HUMAN Sphingosine 1-phosphate receptor Edg-1
Type:
Enzyme
Mol. Mass.:
42836.02
Organism:
Homo sapiens (Human)
Description:
P21453
Residue:
382
  
Inhibitor
Name:
BDBM130386
Synonyms:
US8822510, 4
Type:
Small organic molecule
Emp. Form.:
C27H33FN2O4
Mol. Mass.:
468.5603
SMILES:
Cc1cc(cc(C)c1OC[C@@H](O)CO)-c1noc(CCC2(CCCCC2)c2ccc(F)cc2)n1
: