Target
Ketohexokinase
Ligand
BDBM50349727
Substrate
Meas. Tech.
Enzyme Assay
Temperature
298.15±n/a K
IC50
710±n/a nM
Comments
extracted
Citation
 Zhang, XAbad, MCGibbs, ACKuo, GKuo, LCSong, FSui, Z Indazole compounds useful as ketohexokinase inhibitors US Patent  US8822447 Publication Date 9/2/2014 
Target
Name:
Ketohexokinase
Synonyms:
Hepatic fructokinase KHK_HUMAN Ketohexokinase (KHK) | Ketohexokinase (KHK) Isoform C
Type:
Enzyme Catalytic Domain
Mol. Mass.:
32521.64
Organism:
Homo sapiens (Human)
Description:
Residue:
298
  
Inhibitor
Name:
BDBM50349727
Synonyms:
CHEMBL1809154 US9771375, Example 10
Type:
Small organic molecule
Emp. Form.:
C19H20N4S
Mol. Mass.:
336.454
SMILES:
CSc1nn(-c2ccccc2)c2cc(ccc12)N1CC2CC1CN2
: