Target
High affinity cGMP-specific 3',5'-cyclic phosphodiesterase 9A
Ligand
BDBM130750
Substrate
Meas. Tech.
Inhibition Assay
pH
8±n/a
IC50
4.3±n/a nM
Comments
extracted
Citation
 Kaizawa, HYamamoto, HKamijo, KSugita, MSeo, RYamamoto, SUkai, A Pyrazoloquinoline compound US Patent  US8822448 Publication Date 9/2/2014 
Target
Name:
High affinity cGMP-specific 3',5'-cyclic phosphodiesterase 9A
Synonyms:
PDE9A_RAT Phosphodiesterase 9 (PDE9)
Type:
Enzyme
Mol. Mass.:
61749.01
Organism:
Rattus norvegicus (Rat)
Description:
Q8QZV1
Residue:
534
  
Inhibitor
Name:
BDBM130750
Synonyms:
US8822448, 168
Type:
Small organic molecule
Emp. Form.:
C26H34N4O4
Mol. Mass.:
466.5726
SMILES:
CCOCCC1CCN(CC1)C(=O)c1cc2c3n(ncc3c(=O)[nH]c2cc1C)C1CCOCC1
: