Target
G-protein coupled receptor 6
Ligand
BDBM285604
Substrate
Meas. Tech.
Inhibition of cAMP Activity of GPR6 In Vitro A.2 Assay
IC50
13700±n/a nM
Citation
 Brown, JWHitchcock, SHopkins, MKikuchi, SMonenschein, HReichard, HSchleicher, KSun, HMacklin, T Substituted pyrido[3,4-b]pyrazines as GPR6 modulators US Patent  US10077266 Publication Date 9/18/2018 
Target
Name:
G-protein coupled receptor 6
Synonyms:
G-protein coupled receptor 6 (GPR6) GPR6_HUMAN | Sphingosine 1-phosphate receptor GPR6
Type:
Protein
Mol. Mass.:
37886.39
Organism:
Homo sapiens (Human)
Description:
P46095
Residue:
362
  
Inhibitor
Name:
BDBM285604
Synonyms:
(5-chloro-2-fluorophenyl)(1-(3-(isopropylamino)-6-methyl-5,6,7,8-tetrahydropyrido[3,4-b]pyrazin-2-yl)piperidin-4-yl)methanone | US10077266, Example 86
Type:
Small organic molecule
Emp. Form.:
C22H29ClFN5O
Mol. Mass.:
433.95
SMILES:
CC(C)Nc1nc2CN(C)CCc2nc1N1CCC(CC1)Oc1cc(Cl)ccc1F
: