Target
G-protein coupled receptor 6
Ligand
BDBM190980
Substrate
Meas. Tech.
Inhibition of cAMP Activity of GPR6 In Vitro A.2 Assay
IC50
13800±n/a nM
Citation
 Brown, JWHitchcock, SHopkins, MKikuchi, SMonenschein, HReichard, HSchleicher, KSun, HMacklin, T Substituted pyrido[3,4-b]pyrazines as GPR6 modulators US Patent  US10077266 Publication Date 9/18/2018 
Target
Name:
G-protein coupled receptor 6
Synonyms:
G-protein coupled receptor 6 (GPR6) GPR6_HUMAN | Sphingosine 1-phosphate receptor GPR6
Type:
Protein
Mol. Mass.:
37886.39
Organism:
Homo sapiens (Human)
Description:
P46095
Residue:
362
  
Inhibitor
Name:
BDBM190980
Synonyms:
US10077266, Example 93 US9708313, 93
Type:
Small organic molecule
Emp. Form.:
C26H35FN6O3
Mol. Mass.:
498.5929
SMILES:
COc1ccc(OC2CCN(CC2)c2nc3CN(CCc3nc2NC2CCC2)C(=O)N(C)C)c(F)c1
: