Target
G-protein coupled receptor 6
Ligand
BDBM190996
Substrate
Meas. Tech.
Inhibition of cAMP Activity of GPR6 In Vitro A.2 Assay
IC50
23200±n/a nM
Citation
 Brown, JWHitchcock, SHopkins, MKikuchi, SMonenschein, HReichard, HSchleicher, KSun, HMacklin, T Substituted pyrido[3,4-b]pyrazines as GPR6 modulators US Patent  US10077266 Publication Date 9/18/2018 
Target
Name:
G-protein coupled receptor 6
Synonyms:
G-protein coupled receptor 6 (GPR6) GPR6_HUMAN | Sphingosine 1-phosphate receptor GPR6
Type:
Protein
Mol. Mass.:
37886.39
Organism:
Homo sapiens (Human)
Description:
P46095
Residue:
362
  
Inhibitor
Name:
BDBM190996
Synonyms:
US10077266, Example 109 US9708313, 109
Type:
Small organic molecule
Emp. Form.:
C22H27F4N5O
Mol. Mass.:
453.4763
SMILES:
CC1Cc2nc(NCC(F)F)c(nc2CN1C)N1CCC(CC1)Oc1ccc(F)cc1F
: