Target
Cyclin-dependent kinase 4
Ligand
BDBM132283
Substrate
Meas. Tech.
In Vitro Assay
pH
7.4±n/a
Temperature
310.15±n/a K
IC50
1.6±n/a nM
Citation
 Connors, RVKang, DEksterowicz, JFan, PFisher, BFu, JLi, KLi, ZMcGee, LRSharma, RWang, XMcMinn, DLMihalic, JTDeignan, J Fused pyridine, pyrimidine and triazine compounds as cell cycle inhibitors US Patent  US8841312 Publication Date 9/23/2014 
Target
Name:
Cyclin-dependent kinase 4
Synonyms:
CDK4 Cell division protein kinase 4 PSK-J3
Type:
Enzyme Subunit
Mol. Mass.:
33731.96
Organism:
Homo sapiens (Human)
Description:
P11802
Residue:
303
  
Inhibitor
Name:
BDBM132283
Synonyms:
US8841312, 26
Type:
Small organic molecule
Emp. Form.:
C28H32N8
Mol. Mass.:
480.6073
SMILES:
C1CN(CCN1)c1ccc(Nc2ncc3c(n2)n(c2cnccc32)C23CC4CC(CC(C4)C2)C3)nc1
: