Target
Cannabinoid receptor 2
Ligand
BDBM143542
Substrate
Meas. Tech.
cAMP Assay
Temperature
300.15±n/a K
EC50
3288±n/a nM
Comments
extracted
Citation
 Macielag, MJZhang, YDeCorte, BLGreco, MN Quinazoline derivatives useful as CB-1 inverse agonists US Patent  US9682955 Publication Date 6/20/2017 
Target
Name:
Cannabinoid receptor 2
Synonyms:
CANNABINOID CB2 CB2 CB2B CNR2_HUMAN Cannabinoid CB2 receptor Cannabinoid receptor 2 (CB2R) | hCB2
Type:
G Protein-Coupled Receptor (GPCR)
Mol. Mass.:
39690.94
Organism:
Homo sapiens (Human)
Description:
P34972
Residue:
360
  
Inhibitor
Name:
BDBM143542
Synonyms:
US9682955, 77
Type:
Small organic molecule
Emp. Form.:
C34H30Cl2N4O2
Mol. Mass.:
597.534
SMILES:
OC(=O)Cc1ccc(cc1)N1CCC(CC1)Nc1ncnc2ccc(cc12)C(c1ccc(Cl)cc1)c1ccc(Cl)cc1
: