Target
5-hydroxytryptamine receptor 1A
Ligand
BDBM136344
Substrate
Meas. Tech.
Inhibition Assay
pH
7.4±n/a
Ki
1.1±n/a nM
Comments
extracted
Citation
 Andersson, JGyback, HJohansson, ALinde, CEMalmstrom, JNordvall, GWeigelt, TTerp, G 2-carboxamide-7-piperazinyl-benzofuran derivatives US Patent  US8859534 Publication Date 10/14/2014 
Target
Name:
5-hydroxytryptamine receptor 1A
Synonyms:
5-hydroxytryptamine receptor 1A (5HT1A)
Type:
Protein
Mol. Mass.:
46351.20
Organism:
Cricetulus griseus (Chinese hamster) (Cricetulus barabensis griseus)
Description:
G3I1B6
Residue:
422
  
Inhibitor
Name:
BDBM136344
Synonyms:
US8859534, 30
Type:
Small organic molecule
Emp. Form.:
C26H30N6O2
Mol. Mass.:
458.5554
SMILES:
Cn1cnc(CCNC(=O)c2cc3cccc(N4CCN(CCc5ccccn5)CC4)c3o2)c1
: