Target
Transient receptor potential cation channel subfamily V member 1
Ligand
BDBM144086
Substrate
Meas. Tech.
Activation Assay
IC50
13000±n/a nM
Citation
 Dart, MJKym, PRVoight, EAShrestha, ADaanen, JFJinkerson, TKKeddy, RGPeddi, SGomtsyan, AKort, MEGfesser, GAWoller, KRNelson, DW TRPV1 antagonists US Patent  US8969325 Publication Date 3/3/2015 
Target
Name:
Transient receptor potential cation channel subfamily V member 1
Synonyms:
Capsaicin receptor Osm-9-like TRP channel 1 TRPV1_HUMAN Transient receptor potential cation channel subfamily V member 1 (TRPV1) Transient receptor potential cation channel subfamily V member 1(TRPV1) Vanilloid VR1 Vanilloid receptor 1 Vanilloid receptor 1 (VRI/TRPV1)
Type:
Protein
Mol. Mass.:
94960.75
Organism:
Homo sapiens (Human)
Description:
Q8NER1
Residue:
839
  
Inhibitor
Name:
BDBM144086
Synonyms:
US8969325, 287
Type:
Small organic molecule
Emp. Form.:
C22H24FN3O3
Mol. Mass.:
397.4427
SMILES:
CN1C(=O)CCc2ccc(NC(=O)N[C@H]3CC(C)(C)Oc4ccc(F)cc34)cc12
: