Target
Somatostatin receptor type 1
Ligand
BDBM144776
Substrate
Meas. Tech.
Radioligand Binding Assay
pH
7.6±n/a
Temperature
298.15±n/a K
Ki
10.4±n/a nM
Comments
extracted
Citation
 Dong, ZXShen, YKim, SH Somatostatin-dopamine chimeric analogs US Patent  US8952128 Publication Date 2/10/2015 
Target
Name:
Somatostatin receptor type 1
Synonyms:
SOMATOSTATIN SST1 SS-1-R SS1R SSTR1 | Somatostatin receptor type 1 (SSTR1)
Type:
Enzyme
Mol. Mass.:
42692.81
Organism:
Homo sapiens (Human)
Description:
P30872
Residue:
391
  
Inhibitor
Name:
BDBM144776
Synonyms:
US8952128, 33
Type:
Small organic molecule
Emp. Form.:
C87H111N17O12S
Mol. Mass.:
1618.984
SMILES:
C[C@@H](O)[C@@H]1NC(=O)[C@H](CCCCN)NC(=O)[C@@H](Cc2c[nH]c3ccccc23)NC(=O)[C@H](Cc2ccccc2)NC(=O)[C@H](Cc2ccccc2)NC(=O)[C@H](CCCNC(N)=N)NC(=O)[C@@H](CCCCNC(=O)[C@H](Cc2ccc(O)cc2)NC1=O)NC[C@H](Cc1ccc(O)cc1)NC(=O)CSC[C@@H]1C[C@H]2[C@@H](Cc3c[nH]c4cccc2c34)N(C)C1
: