Target
Apoptosis regulator Bcl-2
Ligand
BDBM47130
Substrate
Meas. Tech.
Time Resolved-Fluorescence Resonance Energy Transfer (TR-FRET) Assay
Temperature
298.15±n/a K
Ki
0.049±n/a nM
Comments
extracted
Citation
 Ding, HDoherty, GAElmore, SWHexamer, LKunzer, ARPark, CSong, XSouers, AJSullivan, GMTao, ZWang, LWendt, MDCzabotar, PELessene, GLColman, PM Apoptosis-inducing agents for the treatment of cancer and immune and autoimmune diseases US Patent  US8952157 Publication Date 2/10/2015 
Target
Name:
Apoptosis regulator Bcl-2
Synonyms:
Apoptosis regulator Bcl-2 Protein BCL-2 BCL2_HUMAN | Bcl-2 Protein
Type:
Homodimer or heterodimer
Mol. Mass.:
26269.11
Organism:
Homo sapiens (Human)
Description:
P10415
Residue:
239
  
Inhibitor
Name:
BDBM47130
Synonyms:
US8952157, 168 US9303025, 34
Type:
Emp. Form.:
C44H50Cl2N6O6S
Mol. Mass.:
861.875
SMILES:
CN1CCC(CC1)Nc1ccc(cc1[N+]([O-])=O)S(=O)(=O)NC(=O)c1ccc(cc1Oc1ccccc1Cl)N1CCN(CC2=C(CC(C)(C)CC2)c2ccc(Cl)cc2)CC1
: