Target
Apoptosis regulator Bcl-2
Ligand
BDBM145037
Substrate
Meas. Tech.
Time Resolved-Fluorescence Resonance Energy Transfer (TR-FRET) Assay
Temperature
298.15±n/a K
Ki
3.283±n/a nM
Comments
extracted
Citation
 Ding, HDoherty, GAElmore, SWHexamer, LKunzer, ARPark, CSong, XSouers, AJSullivan, GMTao, ZWang, LWendt, MDCzabotar, PELessene, GLColman, PM Apoptosis-inducing agents for the treatment of cancer and immune and autoimmune diseases US Patent  US8952157 Publication Date 2/10/2015 
Target
Name:
Apoptosis regulator Bcl-2
Synonyms:
Apoptosis regulator Bcl-2 Protein BCL-2 BCL2_HUMAN | Bcl-2 Protein
Type:
Homodimer or heterodimer
Mol. Mass.:
26269.11
Organism:
Homo sapiens (Human)
Description:
P10415
Residue:
239
  
Inhibitor
Name:
BDBM145037
Synonyms:
US8952157, 225 | US9303025, 225
Type:
Small organic molecule
Emp. Form.:
C50H60ClN7O8S
Mol. Mass.:
954.572
SMILES:
CC(=O)Nc1cccc(Oc2cc(ccc2C(=O)NS(=O)(=O)c2ccc(NC3CCN(CC3)C3CCOCC3)c(c2)[N+]([O-])=O)N2CCN(CC3=C(CC(C)(C)CC3)c3ccc(Cl)cc3)CC2)c1
: