Target
Sodium channel protein type 9 subunit alpha
Ligand
BDBM145390
Substrate
Meas. Tech.
Radioligand Binding Assay
pH
7.4±n/a
Temperature
298.15±n/a K
IC50
3±n/a nM
Comments
extracted
Citation
 Andrez, JChowdhury, SDecker, SMDehnhardt, CMFocken, TGrimwood, MEHemeon, IWJia, QLi, JOrtwine, DFSafina, BSheng, TSun, SSutherlin, DPWilson, MSZenova, AY N-substituted benzamides and methods of use thereof US Patent  US8952169 Publication Date 2/10/2015 
Target
Name:
Sodium channel protein type 9 subunit alpha
Synonyms:
NENA Peripheral sodium channel 1 SCN9A_HUMAN Voltage-gated sodium channel subunit Nav1.7 hNE-Na
Type:
Protein
Mol. Mass.:
226375.97
Organism:
Homo sapiens (Human)
Description:
Q15858
Residue:
1988
  
Inhibitor
Name:
BDBM145390
Synonyms:
US8952169, 169 | US9771376, Example 169
Type:
Small organic molecule
Emp. Form.:
C25H33FN2O5S
Mol. Mass.:
492.603
SMILES:
COC1CN(C1)S(=O)(=O)NC(=O)c1cc(C2CC2)c(OCC23CC4CC(CC(C4)C2)C3)cc1F
: